Target
Angiotensin-converting enzyme
Ligand
BDBM50021268
Substrate
Meas. Tech.
ChEMBL_35995 (CHEMBL644704)
IC50
8.1±n/a nM
Citation
 Thorsett, EDHarris, EEAster, SDPeterson, ERSnyder, JPSpringer, JPHirshfield, JTristram, EWPatchett, AAUlm, EH Conformationally restricted inhibitors of angiotensin converting enzyme: synthesis and computations. J Med Chem 29:251-60 (1986)  
Target
Name:
Angiotensin-converting enzyme
Synonyms:
ACE Angiotensin converting enzyme (ACE) Angiotensin-converting enzyme, soluble form CD_antigen=CD143 DCP1 Kininase II
Type:
Enzyme
Mol. Mass.:
149709.01
Organism:
Homo sapiens (Human)
Description:
Residue:
1306
  
Inhibitor
Name:
BDBM50021268
Synonyms:
2-(1-Carboxymethyl-2-oxo-azonan-3-ylamino)-4-phenyl-butyric acid | CHEMBL86915
Type:
Small organic molecule
Emp. Form.:
C20H28N2O5
Mol. Mass.:
376.4467
SMILES:
OC(=O)CN1CCCCCCC(NC(CCc2ccccc2)C(O)=O)C1=O
: