Target
Adenosine receptor A1
Ligand
BDBM50452321
Substrate
Meas. Tech.
ChEBML_28538
IC50
26±n/a nM
Citation
 Olsson, RAKusachi, SThompson, RDUkena, DPadgett, WDaly, JW N6-substituted N-alkyladenosine-5'-uronamides: bifunctional ligands having recognition groups for A1 and A2 adenosine receptors. J Med Chem 29:1683-9 (1986)  
Target
Name:
Adenosine receptor A1
Synonyms:
AA1R_RAT ADENOSINE A1 high Adenosine A1 receptor (A1) Adenosine receptors A1 | Adora1
Type:
Protein
Mol. Mass.:
36704.13
Organism:
Rattus norvegicus (rat)
Description:
Residue:
326
  
Inhibitor
Name:
BDBM50452321
Synonyms:
CHEMBL2093997
Type:
Small organic molecule
Emp. Form.:
C22H28N6O4
Mol. Mass.:
440.4955
SMILES:
CCNC(=O)[C@H]1O[C@H]([C@H](O)[C@@H]1O)n1cnc2c(N[C@@H](CC)Cc3ccccc3)ncnc12
: