Target
Dihydrofolate reductase
Ligand
BDBM50367055
Substrate
Meas. Tech.
ChEMBL_53887 (CHEMBL668914)
IC50
20±n/a nM
Citation
 Rosowsky, ABader, HRadike-Smith, MCucchi, CAWick, MMFreisheim, JH Methotrexate analogues. 28. Synthesis and biological evaluation of new gamma-monoamides of aminopterin and methotrexate. J Med Chem 29:1703-9 (1986)  
Target
Name:
Dihydrofolate reductase
Synonyms:
DYR_MOUSE | Dhfr
Type:
Enzyme
Mol. Mass.:
21608.82
Organism:
Mus musculus (Mouse)
Description:
Residue:
187
  
Inhibitor
Name:
BDBM50367055
Synonyms:
4-Aminofolic acid AMINOPTERIN | Aminopteroylglutamic acid
Type:
Small organic molecule
Emp. Form.:
C19H20N8O5
Mol. Mass.:
440.4127
SMILES:
Nc1nc(N)c2nc(CNc3ccc(cc3)C(=O)N[C@@H](CCC(O)=O)C(O)=O)cnc2n1
: