Target
5-hydroxytryptamine receptor 1B
Ligand
BDBM21397
Substrate
Meas. Tech.
ChEBML_1800
Ki
4800±n/a nM
Citation
 Glennon, RA Central serotonin receptors as targets for drug research. J Med Chem 30:1-12 (1987)  
Target
Name:
5-hydroxytryptamine receptor 1B
Synonyms:
5-HT-1B 5-hydroxytryptamine receptor 1B (5HT1B) 5ht1b Serotonin 1 (5-HT1) receptor Serotonin receptor 1B
Type:
Protein
Mol. Mass.:
43173.33
Organism:
Rattus norvegicus (Rat)
Description:
P28564
Residue:
386
  
Inhibitor
Name:
BDBM21397
Synonyms:
8-[4-(4-fluorophenyl)-4-keto-butyl]-1-phenyl-1,3,8-triazaspiro[4.5]decan-4-one 8-[4-(4-fluorophenyl)-4-oxobutyl]-1-phenyl-1,3,8-triazaspiro[4.5]decan-4-one MLS000028615 SPIPERONE US9359372, Spiperone cid_5265
Type:
radiolabeled ligand
Emp. Form.:
C23H26FN3O2
Mol. Mass.:
395.4698
SMILES:
Fc1ccc(cc1)C(=O)CCCN1CCC2(CC1)N(CNC2=O)c1ccccc1
: