Target
Thymidylate synthase
Ligand
BDBM50023900
Substrate
Meas. Tech.
ChEMBL_209474 (CHEMBL809254)
IC50
55000±n/a nM
Citation
 Brixner, DIUeda, TCheng, YCHynes, JBBroom, AD Folate analogues as inhibitors of thymidylate synthase. J Med Chem 30:675-8 (1987)  
Target
Name:
Thymidylate synthase
Synonyms:
TS TYMS Thymidylate synthase (TS) | Thymidylate synthase/GAR transformylase/AICAR transformylase
Type:
Enzyme
Mol. Mass.:
35718.07
Organism:
Homo sapiens (Human)
Description:
Residue:
313
  
Inhibitor
Name:
BDBM50023900
Synonyms:
2-{4-[(2-Amino-4-hydroxy-pyrido[3,2-d]pyrimidin-6-ylmethyl)-amino]-benzoylamino}-pentanedioic acid(8-deazafolate) | CHEMBL161265
Type:
Small organic molecule
Emp. Form.:
C20H20N6O6
Mol. Mass.:
440.4094
SMILES:
Nc1nc2ccc(CNc3ccc(cc3)C(=O)N[C@@H](CCC(O)=O)C(O)=O)nc2c(=O)[nH]1
: