Target
Adenosine receptor A1
Ligand
BDBM50367494
Substrate
Meas. Tech.
ChEBML_28964
IC50
8.5±n/a nM
Citation
 Kwatra, MMLeung, EHosey, MMGreen, RD N6-phenyladenosines: pronounced effect of phenyl substituents on affinity for A2 adenosine receptors. J Med Chem 30:954-6 (1987)  
Target
Name:
Adenosine receptor A1
Synonyms:
AA1R_CHICK ADORA1 | Adenosine A1 receptor
Type:
Enzyme Catalytic Domain
Mol. Mass.:
36337.19
Organism:
Chick
Description:
ADENOSINE A1 ADORA1 Chick::P49892
Residue:
324
  
Inhibitor
Name:
BDBM50367494
Synonyms:
CHEMBL608800
Type:
Small organic molecule
Emp. Form.:
C16H16IN5O4
Mol. Mass.:
469.2338
SMILES:
OC[C@H]1OC([C@H](O)[C@@H]1O)n1cnc2c(Nc3ccc(I)cc3)ncnc12
: