Target
Angiotensin-converting enzyme
Ligand
BDBM50021782
Substrate
Meas. Tech.
ChEMBL_35219 (CHEMBL648942)
IC50
57000±n/a nM
Citation
 Blankley, CJKaltenbronn, JSDeJohn, DEWerner, ABennett, LRBobowski, GKrolls, UJohnson, DRPearlman, WMHoefle, ML Synthesis and structure-activity relationships of potent new angiotensin converting enzyme inhibitors containing saturated bicyclic amino acids. J Med Chem 30:992-8 (1987)  
Target
Name:
Angiotensin-converting enzyme
Synonyms:
ACE_RAT Angiotensin-converting enzyme | Dcp1
Type:
PROTEIN
Mol. Mass.:
150907.81
Organism:
Rattus norvegicus
Description:
ChEMBL_35219
Residue:
1313
  
Inhibitor
Name:
BDBM50021782
Synonyms:
(RSR)1-[2-(1-Ethoxycarbonyl-3-phenyl-propylamino)-propionyl]-octahydro-indole-2-carboxylic acid (SSS)1-[2-(1-Ethoxycarbonyl-3-phenyl-propylamino)-propionyl]-octahydro-indole-2-carboxylic acid CHEMBL558810
Type:
Small organic molecule
Emp. Form.:
C24H34N2O5
Mol. Mass.:
430.5372
SMILES:
CCOC(=O)C(CCc1ccccc1)NC(C)C(=O)N1[C@H]2CCCC[C@H]2C[C@H]1C(O)=O
: