Target
Aromatase
Ligand
BDBM50024483
Substrate
Meas. Tech.
ChEBML_51214
EC50
270±n/a nM
Citation
 Taylor, HMJones, CDDavenport, JDHirsch, KSKress, TJWeaver, D Aromatase inhibition by 5-substituted pyrimidines and dihydropyrimidines. J Med Chem 30:1359-65 (1987)  
Target
Name:
Aromatase
Synonyms:
Arom CP19A_RAT Cyp19 Cytochrome P450 19A1 P-450AROM
Type:
PROTEIN
Mol. Mass.:
58418.09
Organism:
Rattus norvegicus
Description:
ChEMBL_51211
Residue:
508
  
Inhibitor
Name:
BDBM50024483
Synonyms:
(4-Nitro-phenyl)-phenyl-pyrimidin-5-yl-methanol | CHEMBL28800
Type:
Small organic molecule
Emp. Form.:
C17H13N3O3
Mol. Mass.:
307.3034
SMILES:
OC(c1ccccc1)(c1ccc(cc1)[N+]([O-])=O)c1cncnc1
: