Target
Aromatase
Ligand
BDBM50024509
Substrate
Meas. Tech.
ChEBML_51214
EC50
>2000±n/a nM
Citation
 Taylor, HMJones, CDDavenport, JDHirsch, KSKress, TJWeaver, D Aromatase inhibition by 5-substituted pyrimidines and dihydropyrimidines. J Med Chem 30:1359-65 (1987)  
Target
Name:
Aromatase
Synonyms:
Arom CP19A_RAT Cyp19 Cytochrome P450 19A1 P-450AROM
Type:
PROTEIN
Mol. Mass.:
58418.09
Organism:
Rattus norvegicus
Description:
ChEMBL_51211
Residue:
508
  
Inhibitor
Name:
BDBM50024509
Synonyms:
CHEMBL285844 | Cyclobutyl-(4-methoxy-phenyl)-pyrimidin-5-yl-methanol
Type:
Small organic molecule
Emp. Form.:
C16H18N2O2
Mol. Mass.:
270.3263
SMILES:
COc1ccc(cc1)C(O)(C1CCC1)c1cncnc1
: