Target
Adenosine receptor A1
Ligand
BDBM50241166
Substrate
Meas. Tech.
ChEBML_29324
Ki
120±n/a nM
Citation
 Trivedi, BKBristol, JABruns, RFHaleen, SJSteffen, RP N6-(arylalkyl)adenosines. Identification of N6-(9-fluorenylmethyl)adenosine as a highly potent agonist for the adenosine A2 receptor. J Med Chem 31:271-3 (1988)  
Target
Name:
Adenosine receptor A1
Synonyms:
AA1R_RAT ADENOSINE A1 high Adenosine A1 receptor (A1) Adenosine receptors A1 | Adora1
Type:
Protein
Mol. Mass.:
36704.13
Organism:
Rattus norvegicus (rat)
Description:
Residue:
326
  
Inhibitor
Name:
BDBM50241166
Synonyms:
(2R,3R,4S,5R)-2-(6-(benzylamino)-9H-purin-9-yl)-5-(hydroxymethyl)-tetrahydrofuran-3,4-diol N6-benzylado
Type:
Small organic molecule
Emp. Form.:
C17H19N5O4
Mol. Mass.:
357.3639
SMILES:
OC[C@H]1O[C@H]([C@H](O)[C@@H]1O)n1cnc2c(NCc3ccccc3)ncnc12
: