Target
Mu-type opioid receptor
Ligand
BDBM50019091
Substrate
Meas. Tech.
ChEBML_148709
Kd
380±n/a nM
Citation
 Lawson, JACheng, ADeGraw, JFrenking, GUyeno, EToll, LLoew, GH Effects of addition of a 2-methyl group to ethyl nipecotates (beta-meperidines) on receptor affinities and opiate agonist/antagonist activities. J Med Chem 31:2015-21 (1988)  
Target
Name:
Mu-type opioid receptor
Synonyms:
MOR-1 Mu-type opioid receptor (MOR) OPRM_RAT Opioid receptor B Ror-b
Type:
G Protein-Coupled Receptor (GPCR)
Mol. Mass.:
44503.11
Organism:
Rattus norvegicus (rat)
Description:
Competition binding assays were carried out using membrane preparations from transfected HN9.10 cells that constitutively expressed the mu opioid receptor.
Residue:
398
  
Inhibitor
Name:
BDBM50019091
Synonyms:
3-(3-Hydroxy-phenyl)-2-methyl-1-phenethyl-piperidine-3-carboxylic acid ethyl ester | CHEMBL300986
Type:
Small organic molecule
Emp. Form.:
C23H29NO3
Mol. Mass.:
367.4813
SMILES:
CCOC(=O)[C@@]1(CCCN(CCc2ccccc2)[C@H]1C)c1cccc(O)c1
: