Target
Cholecystokinin receptor type A
Ligand
BDBM50019207
Substrate
Meas. Tech.
ChEBML_49558
IC50
1.3±n/a nM
Citation
 Evans, BERittle, KEBock, MGDiPardo, RMFreidinger, RMWhitter, WLLundell, GFVeber, DFAnderson, PSChang, RS Methods for drug discovery: development of potent, selective, orally effective cholecystokinin antagonists. J Med Chem 31:2235-46 (1989)  
Target
Name:
Cholecystokinin receptor type A
Synonyms:
CCKAR_RAT Cholecystokinin peripheral Cholecystokinin receptor type A
Type:
Enzyme Catalytic Domain
Mol. Mass.:
49676.37
Organism:
RAT
Description:
Cholecystokinin central 0 RAT::P30551
Residue:
444
  
Inhibitor
Name:
BDBM50019207
Synonyms:
1-Methyl-1H-indole-2-carboxylic acid [5-(2-fluoro-phenyl)-1-methyl-2-oxo-2,3-dihydro-1H-benzo[e][1,4]diazepin-3-yl]-amide CHEMBL303227
Type:
Small organic molecule
Emp. Form.:
C26H21FN4O2
Mol. Mass.:
440.4689
SMILES:
CN1c2ccccc2C(=NC(NC(=O)c2cc3ccccc3n2C)C1=O)c1ccccc1F
: