Target
Adenosine deaminase
Ligand
BDBM50011591
Substrate
Meas. Tech.
ChEBML_30977
Ki
120±n/a nM
Citation
 Cristalli, GFranchetti, PGrifantini, MVittori, SLupidi, GRiva, FBordoni, TGeroni, CVerini, MA Adenosine deaminase inhibitors. Synthesis and biological activity of deaza analogues of erythro-9-(2-hydroxy-3-nonyl)adenine. J Med Chem 31:390-3 (1988)  
Target
Name:
Adenosine deaminase
Synonyms:
ADA ADA_HUMAN | Adenosine aminohydrolase
Type:
Enzyme
Mol. Mass.:
40759.44
Organism:
Homo sapiens (Human)
Description:
Human recombinant ADA was expressed and purified from an ADA-deficient bacterial strain.
Residue:
363
  
Inhibitor
Name:
BDBM50011591
Synonyms:
3-(7-Amino-imidazo[4,5-b]pyridin-3-yl)-nonan-2-ol | CHEMBL18838
Type:
Small organic molecule
Emp. Form.:
C15H24N4O
Mol. Mass.:
276.3773
SMILES:
CCCCCCC(C(C)O)n1cnc2c(N)ccnc12
: