Target
D(2) dopamine receptor
Ligand
BDBM50020123
Substrate
Meas. Tech.
ChEBML_62891
Ki
248±n/a nM
Citation
 Abou-Gharbia, MPatel, URWebb, MBMoyer, JAAndree, THMuth, EA Polycyclic aryl- and heteroarylpiperazinyl imides as 5-HT1A receptor ligands and potential anxiolytic agents: synthesis and structure-activity relationship studies. J Med Chem 31:1382-92 (1988)  
Target
Name:
D(2) dopamine receptor
Synonyms:
DOPAMINE D2 DOPAMINE D2 Short Dopamine D2 receptor Drd2
Type:
G Protein-Coupled Receptor (GPCR)
Mol. Mass.:
50931.60
Organism:
Rattus norvegicus (rat)
Description:
P61169
Residue:
444
  
Inhibitor
Name:
BDBM50020123
Synonyms:
4-[4-(4-Pyrimidin-2-yl-piperazin-1-yl)-butyl]-4-aza-tricyclo[5.2.1.0*2,6*]dec-8-ene-3,5-dione;C4H4O4 | CHEMBL28352
Type:
Small organic molecule
Emp. Form.:
C21H27N5O2
Mol. Mass.:
381.4714
SMILES:
O=C1C2C3CC(C=C3)C2C(=O)N1CCCCN1CCN(CC1)c1ncccn1
: