Target
5-hydroxytryptamine receptor 1A
Ligand
BDBM50367731
Substrate
Meas. Tech.
ChEBML_1423
Ki
12±n/a nM
Citation
 Abou-Gharbia, MPatel, URWebb, MBMoyer, JAAndree, THMuth, EA Polycyclic aryl- and heteroarylpiperazinyl imides as 5-HT1A receptor ligands and potential anxiolytic agents: synthesis and structure-activity relationship studies. J Med Chem 31:1382-92 (1988)  
Target
Name:
5-hydroxytryptamine receptor 1A
Synonyms:
5-HT-1A 5-HT1A 5-hydroxytryptamine receptor 1A (5HT1A) 5ht1a Htr1a Serotonin 1a (5-HT1a) receptor/Adrenergic receptor alpha-1 | Serotonin receptor 1A
Type:
G Protein-Coupled Receptor (GPCR)
Mol. Mass.:
46445.29
Organism:
Rattus norvegicus (rat)
Description:
Binding assays were performed using rat hippocampal membranes.
Residue:
422
  
Inhibitor
Name:
BDBM50367731
Synonyms:
CHEMBL1202506
Type:
Small organic molecule
Emp. Form.:
C23H31N5O2
Mol. Mass.:
409.5245
SMILES:
O=C1C2C(C3CCCC2C=C3)C(=O)N1CCCCN1CCN(CC1)c1ncccn1
: