Target
Renin
Ligand
BDBM50021989
Substrate
Meas. Tech.
ChEBML_195759
IC50
0.500000±n/a nM
Citation
 Hui, KYHoltzman, EJQuinones, MAHollenberg, NKHaber, E Design of rat renin inhibitory peptides. J Med Chem 31:1679-86 (1988)  
Target
Name:
Renin
Synonyms:
Angiotensinogenase RENI_HUMAN
Type:
Enzyme
Mol. Mass.:
45058.99
Organism:
Homo sapiens (Human)
Description:
Residue:
406
  
Inhibitor
Name:
BDBM50021989
Synonyms:
Ac-His-Pro-Phe-His-ACHPA-Leu-Phe-NH2 | CHEMBL386861
Type:
Small organic molecule
Emp. Form.:
C54H74N12O9
Mol. Mass.:
1035.2404
SMILES:
CC(C)C[C@H](NC(=O)C[C@H](O)[C@H](CC1CCCCC1)NC(=O)[C@H](Cc1cnc[nH]1)NC(=O)[C@H](Cc1ccccc1)NC(=O)[C@H]1CCCN1C(=O)[C@H](Cc1cnc[nH]1)NC(C)=O)C(=O)N[C@@H](Cc1ccccc1)C(N)=O
: