Target
Adenosylhomocysteinase
Ligand
BDBM50023887
Substrate
Meas. Tech.
ChEBML_197203
Ki
170±n/a nM
Citation
 Borcherding, DRNarayanan, SHasobe, MMcKee, JGKeller, BTBorchardt, RT Potential inhibitors of S-adenosylmethionine-dependent methyltransferases. 11. Molecular dissections of neplanocin A as potential inhibitors of S-adenosylhomocysteine hydrolase. J Med Chem 31:1729-38 (1988)  
Target
Name:
Adenosylhomocysteinase
Synonyms:
AHCY SAHH | SAHH_HUMAN
Type:
PROTEIN
Mol. Mass.:
47714.06
Organism:
Homo sapiens (Human)
Description:
ChEMBL_1507791
Residue:
432
  
Inhibitor
Name:
BDBM50023887
Synonyms:
4-(6-Amino-purin-9-yl)-2-methyl-but-2-en-1-ol | CHEMBL415930
Type:
Small organic molecule
Emp. Form.:
C10H13N5O
Mol. Mass.:
219.2431
SMILES:
C\C(CO)=C\Cn1cnc2c(N)ncnc12
: