Target
Adenosylhomocysteinase
Ligand
BDBM50011170
Substrate
Meas. Tech.
ChEBML_197369
IC50
28000±n/a nM
Citation
 Madhavan, GVMcGee, DPRydzewski, RMBoehme, RMartin, JCPrisbe, EJ Synthesis and antiviral evaluation of 6'-substituted aristeromycins: potential mechanism-based inhibitors of S-adenosylhomocysteine hydrolase. J Med Chem 31:1798-804 (1988)  
Target
Name:
Adenosylhomocysteinase
Synonyms:
AHCY SAHH | SAHH_HUMAN
Type:
PROTEIN
Mol. Mass.:
47714.06
Organism:
Homo sapiens (Human)
Description:
ChEMBL_1507791
Residue:
432
  
Inhibitor
Name:
BDBM50011170
Synonyms:
3-(6-Amino-purin-9-yl)-5-hydroxymethyl-cyclopentane-1,2,4-triol | CHEMBL430774
Type:
Small organic molecule
Emp. Form.:
C11H15N5O4
Mol. Mass.:
281.2679
SMILES:
Nc1ncnc2n(cnc12)C1C(O)C(O)C(CO)C1O
: