Target
Muscarinic acetylcholine receptor M1/M2/M3/M4/M5
Ligand
BDBM50020521
Substrate
Meas. Tech.
ChEMBL_138643 (CHEMBL749273)
IC50
80000±n/a nM
Citation
 Bedford, CDHarris, RNHowd, RAGoff, DAKoolpe, GAPetesch, MMiller, ANolen, HWMusallam, HAPick, RO Quaternary salts of 2-[(hydroxyimino)methyl]imidazole. 2. Preparation and in vitro and in vivo evaluation of 1-(alkoxymethyl)-2-[(hydroxyimino)methyl]-3-methylimida zolium halides for reactivation of organophosphorus-inhibited acetylcholinesterases. J Med Chem 32:493-503 (1989)  
Target
Name:
Muscarinic acetylcholine receptor M1/M2/M3/M4/M5
Synonyms:
Muscarinic acetylcholine receptor
Type:
Mol. Mass.:
Description:
ASSAY_ID of ChEMBL is 138646
Components:
This complex has 5 components.
Component 1
Name:
Muscarinic acetylcholine receptor M2
Synonyms:
ACM2_MOUSE Chrm2 | Muscarinic acetylcholine receptor
Type:
PROTEIN
Mol. Mass.:
51515.43
Organism:
Mus musculus
Description:
ChEMBL_139897
Residue:
466
  
Component 2
Name:
Muscarinic acetylcholine receptor M5
Synonyms:
ACM5_MOUSE Muscarinic acetylcholine receptor | Muscarinic acetylcholine receptor M5
Type:
PROTEIN
Mol. Mass.:
60282.66
Organism:
Mus musculus
Description:
ChEMBL_104873
Residue:
532
  
Component 3
Name:
Muscarinic acetylcholine receptor M4
Synonyms:
ACM4_MOUSE Chrm-4 Mm4 mAChR | Muscarinic acetylcholine receptor
Type:
Enzyme Catalytic Domain
Mol. Mass.:
53004.88
Organism:
MOUSE
Description:
Cholinergic, muscarinic M4 CHRM4 MOUSE::P32211
Residue:
479
  
Component 4
Name:
Muscarinic acetylcholine receptor M3
Synonyms:
ACM3_MOUSE Chrm3 Muscarinic acetylcholine receptor | Muscarinic acetylcholine receptor M3
Type:
PROTEIN
Mol. Mass.:
66232.94
Organism:
Mus musculus
Description:
ChEMBL_138834
Residue:
589
  
Component 5
Name:
Muscarinic acetylcholine receptor M1
Synonyms:
ACM1_MOUSE Cholinergic, muscarinic Chrm1 Muscarinic acetylcholine receptor M1
Type:
Enzyme Catalytic Domain
Mol. Mass.:
51400.50
Organism:
Mus musculus
Description:
Cholinergic, muscarinic 0 0::Q52KQ0
Residue:
460
  
Inhibitor
Name:
BDBM50020521
Synonyms:
2-(Hydroxyimino-methyl)-3-methyl-1-(1,2,2-trimethyl-propoxymethyl)-3H-imidazol-1-ium; chloride | CHEMBL32585
Type:
Small organic molecule
Emp. Form.:
C12H22N3O2
Mol. Mass.:
240.3214
SMILES:
CC(OC[n+]1ccn(C)c1CN=O)C(C)(C)C
: