Target
5-hydroxytryptamine receptor 1A/1B/1D/1F
Ligand
BDBM50016964
Substrate
Meas. Tech.
ChEMBL_764 (CHEMBL615866)
IC50
8.1±n/a nM
Citation
 New, JSChristopher, WLYevich, JPButler, RSchlemmer, RFVanderMaelen, CPCipollina, JA The thieno[3,2-c]pyridine and furo[3,2-c]pyridine rings: new pharmacophores with potential antipsychotic activity. J Med Chem 32:1147-56 (1989)  
Target
Name:
5-hydroxytryptamine receptor 1A/1B/1D/1F
Synonyms:
Serotonin 1 (5-HT1) receptor
Type:
Mol. Mass.:
Description:
ASSAY_ID of ChEMBL is 193825
Components:
This complex has 4 components.
Component 1
Name:
5-hydroxytryptamine receptor 1D
Synonyms:
5-HT-1D 5-hydroxytryptamine receptor 1D Htr1d Serotonin 1B/1D receptor | Serotonin receptor 1D
Type:
Enzyme Catalytic Domain
Mol. Mass.:
41551.75
Organism:
RAT
Description:
5-HT1D HTR1D RAT::P28565
Residue:
374
  
Component 2
Name:
5-hydroxytryptamine receptor 1A
Synonyms:
5-HT-1A 5-HT1A 5-hydroxytryptamine receptor 1A (5HT1A) 5ht1a Htr1a Serotonin 1a (5-HT1a) receptor/Adrenergic receptor alpha-1 | Serotonin receptor 1A
Type:
G Protein-Coupled Receptor (GPCR)
Mol. Mass.:
46445.29
Organism:
Rattus norvegicus (rat)
Description:
Binding assays were performed using rat hippocampal membranes.
Residue:
422
  
Component 3
Name:
5-hydroxytryptamine receptor 1B
Synonyms:
5-HT-1B 5-hydroxytryptamine receptor 1B (5HT1B) 5ht1b Serotonin 1 (5-HT1) receptor Serotonin receptor 1B
Type:
Protein
Mol. Mass.:
43173.33
Organism:
Rattus norvegicus (Rat)
Description:
P28564
Residue:
386
  
Component 4
Name:
5-hydroxytryptamine receptor 1F
Synonyms:
5-HT-1F 5-hydroxytryptamine receptor 1F 5ht1f Serotonin 1 (5-HT1) receptor Serotonin receptor 1F
Type:
Enzyme Catalytic Domain
Mol. Mass.:
41896.93
Organism:
RAT
Description:
5-HT1F HTR1F RAT::P30940
Residue:
366
  
Inhibitor
Name:
BDBM50016964
Synonyms:
3-[4-(4-Thieno[3,2-c]pyridin-4-yl-piperazin-1-yl)-butyl]-1-thia-3-aza-spiro[4.4]nonane-2,4-dione; hydrochloride | CHEMBL537707
Type:
Small organic molecule
Emp. Form.:
C22H28N4O2S2
Mol. Mass.:
444.613
SMILES:
O=C1SC2(CCCC2)C(=O)N1CCCCN1CCN(CC1)c1nccc2sccc12
: