Target
Aminopeptidase B
Ligand
BDBM50008434
Substrate
Meas. Tech.
ChEBML_35354
Ki
170±n/a nM
Citation
 Harbeson, SLRich, DH Inhibition of aminopeptidases by peptides containing ketomethylene and hydroxyethylene amide bond replacements. J Med Chem 32:1378-92 (1989)  
Target
Name:
Aminopeptidase B
Synonyms:
AMPB_RAT Arginine aminopeptidase Cytosol aminopeptidase IV | Rnpep
Type:
PROTEIN
Mol. Mass.:
72609.93
Organism:
Rattus norvegicus
Description:
ChEMBL_1344423
Residue:
650
  
Inhibitor
Name:
BDBM50008434
Synonyms:
5-Amino-2-benzyl-7-methyl-4-oxo-octanoic acid | CHEMBL140459
Type:
Small organic molecule
Emp. Form.:
C16H23NO3
Mol. Mass.:
277.3587
SMILES:
CC(C)C[C@H](N)C(=O)CC(Cc1ccccc1)C(O)=O
: