Target
D(2) dopamine receptor
Ligand
BDBM50012971
Substrate
Meas. Tech.
ChEBML_62898
Ki
82±n/a nM
Citation
 Murphy, RAKung, HFKung, MPBillings, J Synthesis and characterization of iodobenzamide analogues: potential D-2 dopamine receptor imaging agents. J Med Chem 33:171-8 (1990)  
Target
Name:
D(2) dopamine receptor
Synonyms:
DOPAMINE D2 DOPAMINE D2 Short Dopamine D2 receptor Drd2
Type:
G Protein-Coupled Receptor (GPCR)
Mol. Mass.:
50931.60
Organism:
Rattus norvegicus (rat)
Description:
P61169
Residue:
444
  
Inhibitor
Name:
BDBM50012971
Synonyms:
7-Bromo-3-methoxy-naphthalene-2-carboxylic acid (1-ethyl-pyrrolidin-2-ylmethyl)-amide | CHEMBL49898
Type:
Small organic molecule
Emp. Form.:
C19H23BrN2O2
Mol. Mass.:
391.302
SMILES:
CCN1CCC[C@H]1CNC(=O)c1cc2cc(Br)ccc2cc1OC
: