Target
Beta-1 adrenergic receptor
Ligand
BDBM50367951
Substrate
Meas. Tech.
ChEBML_56503
IC50
1600±n/a nM
Citation
 Lis, RMorgan, TKMarisca, AJGomez, RPLind, JMDavey, DDPhillips, GBSullivan, ME Synthesis of novel (aryloxy)propanolamines and related compounds possessing both class II and class III antiarrhythmic activity. J Med Chem 33:2883-91 (1990)  
Target
Name:
Beta-1 adrenergic receptor
Synonyms:
ADRB1 ADRB1_HUMAN Beta-1 adrenoceptor | adrenergic Beta1
Type:
G Protein-Coupled Receptor (GPCR)
Mol. Mass.:
51338.40
Organism:
Homo sapiens (Human)
Description:
P08588
Residue:
477
  
Inhibitor
Name:
BDBM50367951
Synonyms:
CHEMBL1193886
Type:
Small organic molecule
Emp. Form.:
C21H26N4O5S
Mol. Mass.:
446.52
SMILES:
CS(=O)(=O)Nc1ccc(OC[C@@H](O)CNCCOc2ccc(cc2)-n2ccnc2)cc1
: