Target
Transporter
Ligand
BDBM50010871
Substrate
Meas. Tech.
ChEBML_177401
IC50
2400±n/a nM
Citation
 Yardley, JPHusbands, GEStack, GButch, JBicksler, JMoyer, JAMuth, EAAndree, TFletcher, HJames, MN 2-Phenyl-2-(1-hydroxycycloalkyl)ethylamine derivatives: synthesis and antidepressant activity. J Med Chem 33:2899-905 (1990)  
Target
Name:
Transporter
Synonyms:
Monoamine transporters; Norepininephrine & dopamine | Norepinephrine Monoamine transporters
Type:
PROTEIN
Mol. Mass.:
66787.87
Organism:
Rattus norvegicus
Description:
ChEMBL_1463061
Residue:
597
  
Inhibitor
Name:
BDBM50010871
Synonyms:
1-[2-Dimethylamino-1-(4-trifluoromethyl-phenyl)-ethyl]-cycloheptanol (HCl) | CHEMBL100191
Type:
Small organic molecule
Emp. Form.:
C18H26F3NO
Mol. Mass.:
329.4003
SMILES:
CN(C)CC(c1ccc(cc1)C(F)(F)F)C1(O)CCCCCC1
: