Target
Alpha-1A adrenergic receptor
Ligand
BDBM50010859
Substrate
Meas. Tech.
ChEBML_88911
IC50
1.7±n/a nM
Citation
 Yardley, JPHusbands, GEStack, GButch, JBicksler, JMoyer, JAMuth, EAAndree, TFletcher, HJames, MN 2-Phenyl-2-(1-hydroxycycloalkyl)ethylamine derivatives: synthesis and antidepressant activity. J Med Chem 33:2899-905 (1990)  
Target
Name:
Alpha-1A adrenergic receptor
Synonyms:
ADA1A_RAT Adra1c Alpha-1A adrenoceptor Alpha-1C adrenergic receptor | adrenergic Alpha1A
Type:
Protein
Mol. Mass.:
51620.15
Organism:
Rattus norvegicus (Rat)
Description:
P43140
Residue:
466
  
Inhibitor
Name:
BDBM50010859
Synonyms:
CHEMBL11 IMIPRAMINE PAMOATE | Imipramin
Type:
Small organic molecule
Emp. Form.:
C19H24N2
Mol. Mass.:
280.4073
SMILES:
CN(C)CCCN1c2ccccc2CCc2ccccc12
: