Target
Alpha-1A adrenergic receptor
Ligand
BDBM50010889
Substrate
Meas. Tech.
ChEBML_88911
IC50
>10000±n/a nM
Citation
 Yardley, JPHusbands, GEStack, GButch, JBicksler, JMoyer, JAMuth, EAAndree, TFletcher, HJames, MN 2-Phenyl-2-(1-hydroxycycloalkyl)ethylamine derivatives: synthesis and antidepressant activity. J Med Chem 33:2899-905 (1990)  
Target
Name:
Alpha-1A adrenergic receptor
Synonyms:
ADA1A_RAT Adra1c Alpha-1A adrenoceptor Alpha-1C adrenergic receptor | adrenergic Alpha1A
Type:
Protein
Mol. Mass.:
51620.15
Organism:
Rattus norvegicus (Rat)
Description:
P43140
Residue:
466
  
Inhibitor
Name:
BDBM50010889
Synonyms:
1-[2-Dimethylamino-1-(4-methoxy-phenyl)-ethyl]-cyclooctanol(HCl.0.25H2O) | CHEMBL95251
Type:
Small organic molecule
Emp. Form.:
C19H31NO2
Mol. Mass.:
305.4549
SMILES:
COc1ccc(cc1)C(CN(C)C)C1(O)CCCCCCC1
: