Target
Sodium-dependent serotonin transporter
Ligand
BDBM50010871
Substrate
Meas. Tech.
ChEBML_177402
IC50
500±n/a nM
Citation
 Yardley, JPHusbands, GEStack, GButch, JBicksler, JMoyer, JAMuth, EAAndree, TFletcher, HJames, MN 2-Phenyl-2-(1-hydroxycycloalkyl)ethylamine derivatives: synthesis and antidepressant activity. J Med Chem 33:2899-905 (1990)  
Target
Name:
Sodium-dependent serotonin transporter
Synonyms:
5-HT Transporter 5HT transporter Anandamid membrane transporter, AMT Monoamine transporters; Norepinephrine & serotonin Slc6a4 Sodium-dependent serotonin transporter (SERT) | imipramine receptor
Type:
Multi-pass membrane protein
Mol. Mass.:
70168.43
Organism:
Rattus norvegicus (rat)
Description:
P31652
Residue:
630
  
Inhibitor
Name:
BDBM50010871
Synonyms:
1-[2-Dimethylamino-1-(4-trifluoromethyl-phenyl)-ethyl]-cycloheptanol (HCl) | CHEMBL100191
Type:
Small organic molecule
Emp. Form.:
C18H26F3NO
Mol. Mass.:
329.4003
SMILES:
CN(C)CC(c1ccc(cc1)C(F)(F)F)C1(O)CCCCCC1
: