Target
Adenosine receptor A1
Ligand
BDBM50008413
Substrate
Meas. Tech.
ChEBML_29453
Ki
6.9±n/a nM
Citation
 Peet, NPLentz, NLMeng, ECDudley, MWOgden, AMDemeter, DAWeintraub, HJBey, P A novel synthesis of xanthines: support for a new binding mode for xanthines with respect to adenosine at adenosine receptors. J Med Chem 33:3127-30 (1991)  
Target
Name:
Adenosine receptor A1
Synonyms:
AA1R_RAT ADENOSINE A1 high Adenosine A1 receptor (A1) Adenosine receptors A1 | Adora1
Type:
Protein
Mol. Mass.:
36704.13
Organism:
Rattus norvegicus (rat)
Description:
Residue:
326
  
Inhibitor
Name:
BDBM50008413
Synonyms:
8-(1-Methyl-2-phenyl-ethyl)-1,3-dipropyl-3,7-dihydro-purine-2,6-dione CHEMBL262984
Type:
Small organic molecule
Emp. Form.:
C20H26N4O2
Mol. Mass.:
354.446
SMILES:
CCCn1c2nc([nH]c2c(=O)n(CCC)c1=O)[C@H](C)Cc1ccccc1
: