Target
Thromboxane-A synthase
Ligand
BDBM50368032
Substrate
Meas. Tech.
ChEMBL_209952 (CHEMBL820608)
IC50
5300±n/a nM
Citation
 Archibald, JLBradley, GOpalko, AWard, TJWhite, JCEnnis, CShepperson, NB Design of an antithrombotic-antihypertensive agent (Wy 27569). Synthesis and evaluation of a series of 2-heteroaryl-substituted dihydropyridines. J Med Chem 33:646-52 (1990)  
Target
Name:
Thromboxane-A synthase
Synonyms:
CYP5 Cytochrome P450 5A1 TBXAS1 TXA synthase TXS Thromboxane A2 Synthase (P450 TxA2) Thromboxane prostanoid Thromboxane-A synthase
Type:
Enzyme
Mol. Mass.:
60524.67
Organism:
Homo sapiens (Human)
Description:
P24557
Residue:
533
  
Inhibitor
Name:
BDBM50368032
Synonyms:
CHEMBL1203662
Type:
Small organic molecule
Emp. Form.:
C27H30N6O6
Mol. Mass.:
534.5637
SMILES:
CCOC(=O)C1C(C(C(=O)OCC)=C(CCn2ccnc2)N=C1CCn1ccnc1)c1cccc(c1)[N+]([O-])=O
: