Target
Thromboxane-A synthase
Ligand
BDBM50014918
Substrate
Meas. Tech.
ChEBML_210101
IC50
3200±n/a nM
Citation
 Archibald, JLBradley, GOpalko, AWard, TJWhite, JCEnnis, CShepperson, NB Design of an antithrombotic-antihypertensive agent (Wy 27569). Synthesis and evaluation of a series of 2-heteroaryl-substituted dihydropyridines. J Med Chem 33:646-52 (1990)  
Target
Name:
Thromboxane-A synthase
Synonyms:
CYP5 Cytochrome P450 5A1 TBXAS1 TXA synthase TXS Thromboxane A2 Synthase (P450 TxA2) Thromboxane prostanoid Thromboxane-A synthase
Type:
Enzyme
Mol. Mass.:
60524.67
Organism:
Homo sapiens (Human)
Description:
P24557
Residue:
533
  
Inhibitor
Name:
BDBM50014918
Synonyms:
2-Imidazol-1-ylmethyl-6-methyl-4-(2-nitro-phenyl)-1,4-dihydro-pyridine-3,5-dicarboxylic acid 3-ethyl ester 5-methyl ester : (succinate) | CHEMBL345471
Type:
Small organic molecule
Emp. Form.:
C21H22N4O6
Mol. Mass.:
426.4226
SMILES:
CCOC(=O)C1=C(Cn2ccnc2)N=C(C)C(C1c1ccccc1[N+]([O-])=O)C(=O)OC
: