Target
Atrial natriuretic peptide receptor 2
Ligand
BDBM50013342
Substrate
Meas. Tech.
ChEBML_35003
IC50
8.7±n/a nM
Citation
 DiMaio, JJaramillo, JWernic, DGrenier, LWelchner, EAdams, J Synthesis and biological activity of atrial natriuretic factor analogues: effect of modifications to the disulfide bridge. J Med Chem 33:661-7 (1990)  
Target
Name:
Atrial natriuretic peptide receptor 2
Synonyms:
ANP-B ANPRB_BOVIN Atrial natriuretic peptide receptor B Guanylate cyclase B NPR2
Type:
PROTEIN
Mol. Mass.:
117152.29
Organism:
Bos taurus
Description:
ChEMBL_35003
Residue:
1047
  
Inhibitor
Name:
BDBM50013342
Synonyms:
CHEMBL3349625
Type:
Small organic molecule
Emp. Form.:
C104H159N33O34S
Mol. Mass.:
2447.641
SMILES:
[#6]-[#6]-[#6@H](-[#6])-[#6@H](-[#7]-[#6](=O)-[#6@H](-[#6]-[#6]-[#6]\[#7]=[#6](\[#7])-[#7])-[#7]-[#6](=O)-[#6@H](-[#6]-[#6](-[#8])=O)-[#7]-[#6](=O)-[#6@@H](-[#7]-[#6](=O)-[#6@H](-[#6]-[#6]-[#6]\[#7]=[#6](\[#7])-[#7])-[#7]-[#6](=O)-[#6]-[#7]-[#6](=O)-[#6]-[#7]-[#6](=O)-[#6@H](-[#6]-c1ccccc1)-[#7]-[#6](=O)-[#7]-[#6@@H](-[#6]-[#6](=O)-[#8]-[#6])-[#6](-[#8])=O)-[#6@@H](-[#6])-[#6]-[#6])-[#6](=O)-[#7]-[#6]-[#6](=O)-[#7]-[#6@@H](-[#6])-[#6](=O)-[#7]-[#6@@H](-[#6]-[#6]-[#6](-[#7])=O)-[#6](=O)-[#7]-[#6@@H](-[#6]-[#8])-[#6](=O)-[#7]-[#6]-[#6](=O)-[#7]-[#6@@H](-[#6]-[#6](-[#6])-[#6])-[#6](=O)-[#7]-[#6]-[#6](=O)-[#7]-[#6@@H](-[#6]-[#16])-[#6](=O)-[#7]-[#6@@H](-[#6]-[#6](-[#7])=O)-[#6](=O)-[#7]-[#6@@H](-[#6]-[#8])-[#6](=O)-[#7]-[#6@@H](-[#6]-c1ccccc1)-[#6](=O)-[#7]-[#6@@H](-[#6]-[#6]-[#6]\[#7]=[#6](\[#7])-[#7])-[#6](=O)-[#7]-[#6@@H](-[#6]-c1ccc(-[#8])cc1)-[#6](-[#8])=O
: