Target
D(2) dopamine receptor
Ligand
BDBM50368060
Substrate
Meas. Tech.
ChEMBL_61432 (CHEMBL671406)
IC50
2.4±n/a nM
Citation
 Högberg, TBengtsson, Sde Paulis, TJohansson, LStröm, PHall, HOgren, SO Potential antipsychotic agents 5. Synthesis and antidopaminergic properties of substituted 5,6-dimethoxysalicylamides and related compounds. J Med Chem 33:1155-63 (1990)  
Target
Name:
D(2) dopamine receptor
Synonyms:
DOPAMINE D2 DOPAMINE D2 Short Dopamine D2 receptor Drd2
Type:
G Protein-Coupled Receptor (GPCR)
Mol. Mass.:
50931.60
Organism:
Rattus norvegicus (rat)
Description:
P61169
Residue:
444
  
Inhibitor
Name:
BDBM50368060
Synonyms:
CHEMBL1907695
Type:
Small organic molecule
Emp. Form.:
C19H30N2O4
Mol. Mass.:
350.4525
SMILES:
CCCc1cc(OC)c(OC)c(C(=O)NC[C@@H]2CCCN2CC)c1O
: