Target
D(2) dopamine receptor
Ligand
BDBM50368064
Substrate
Meas. Tech.
ChEBML_61432
IC50
420±n/a nM
Citation
 Högberg, TBengtsson, Sde Paulis, TJohansson, LStröm, PHall, HOgren, SO Potential antipsychotic agents 5. Synthesis and antidopaminergic properties of substituted 5,6-dimethoxysalicylamides and related compounds. J Med Chem 33:1155-63 (1990)  
Target
Name:
D(2) dopamine receptor
Synonyms:
DOPAMINE D2 DOPAMINE D2 Short Dopamine D2 receptor Drd2
Type:
G Protein-Coupled Receptor (GPCR)
Mol. Mass.:
50931.60
Organism:
Rattus norvegicus (rat)
Description:
P61169
Residue:
444
  
Inhibitor
Name:
BDBM50368064
Synonyms:
CHEMBL1907701
Type:
Small organic molecule
Emp. Form.:
C17H25ClN2O4
Mol. Mass.:
356.844
SMILES:
CCN1CCC[C@H]1CNC(=O)c1c(OC)c(Cl)cc(OC)c1OC
: