Target
Thymidylate synthase
Ligand
BDBM50008294
Substrate
Meas. Tech.
ChEBML_209960
IC50
50±n/a nM
Citation
 McNamara, DJBerman, EMFry, DWWerbel, LM Potent inhibition of thymidylate synthase by two series of nonclassical quinazolines. J Med Chem 33:2045-51 (1990)  
Target
Name:
Thymidylate synthase
Synonyms:
TS TYSY_MOUSE | Tyms
Type:
PROTEIN
Mol. Mass.:
34957.15
Organism:
Mus musculus
Description:
ChEMBL_1340097
Residue:
307
  
Inhibitor
Name:
BDBM50008294
Synonyms:
2-(4-(((2-amino-4-oxo-1,4-dihydroquinazolin-6-yl)methyl)(prop-2-ynyl)amino)benzamido)pentanedioic acid 2-{4-[(2-Amino-4-oxo-3,4-dihydro-quinazolin-6-ylmethyl)-prop-2-ynyl-amino]-benzoylamino}-pentanedioic acid 2-{4-[(2-Amino-4-oxo-3,4-dihydro-quinazolin-6-ylmethyl)-prop-2-ynyl-amino]-benzoylamino}-pentanedioic acid(N10-propargyl-5,8-dideazafolate, PDDF) CHEMBL422395 | PDDF
Type:
Small organic molecule
Emp. Form.:
C24H23N5O6
Mol. Mass.:
477.4693
SMILES:
Nc1nc2ccc(CN(CC#C)c3ccc(cc3)C(=O)NC(CCC(O)=O)C(O)=O)cc2c(=O)[nH]1
: