Target
D(1A) dopamine receptor
Ligand
BDBM50010732
Substrate
Meas. Tech.
ChEBML_58183
IC50
11400±n/a nM
Citation
 Claudi, FCardellini, MCingolani, GMPiergentili, APeruzzi, GBalduini, W Synthesis and dopamine receptor affinities of 2-(4-fluoro-3- hydroxyphenyl)ethylamine and N-substituted derivatives. J Med Chem 33:2408-12 (1990)  
Target
Name:
D(1A) dopamine receptor
Synonyms:
DOPAMINE D1 Dopamine D1 high Dopamine receptor Dopamine1-like Drd1a
Type:
Enzyme Catalytic Domain
Mol. Mass.:
49429.75
Organism:
RAT
Description:
P18901
Residue:
446
  
Inhibitor
Name:
BDBM50010732
Synonyms:
5-(2-Dipropylamino-ethyl)-2-fluoro-phenol; hydrobromide | CHEMBL541304
Type:
Small organic molecule
Emp. Form.:
C14H22FNO
Mol. Mass.:
239.329
SMILES:
CCCN(CCC)CCc1ccc(F)c(O)c1
: