Target
D(2) dopamine receptor
Ligand
BDBM50010734
Substrate
Meas. Tech.
ChEMBL_58703 (CHEMBL672048)
IC50
1970±n/a nM
Citation
 Claudi, FCardellini, MCingolani, GMPiergentili, APeruzzi, GBalduini, W Synthesis and dopamine receptor affinities of 2-(4-fluoro-3- hydroxyphenyl)ethylamine and N-substituted derivatives. J Med Chem 33:2408-12 (1990)  
Target
Name:
D(2) dopamine receptor
Synonyms:
DOPAMINE D2 DOPAMINE D2 Short Dopamine D2 receptor Drd2
Type:
G Protein-Coupled Receptor (GPCR)
Mol. Mass.:
50931.60
Organism:
Rattus norvegicus (rat)
Description:
P61169
Residue:
444
  
Inhibitor
Name:
BDBM50010734
Synonyms:
5-[2-(Ethyl-propyl-amino)-ethyl]-2-fluoro-phenol; hydrobromide | CHEMBL540036
Type:
Small organic molecule
Emp. Form.:
C13H20FNO
Mol. Mass.:
225.3024
SMILES:
CCCN(CC)CCc1ccc(F)c(O)c1
: