Target
Sigma non-opioid intracellular receptor 1
Ligand
BDBM50010741
Substrate
Meas. Tech.
ChEBML_201720
IC50
3500±n/a nM
Citation
 Scherz, MWFialeix, MFischer, JBReddy, NLServer, ACSonders, MSTester, BCWeber, EWong, STKeana, JF Synthesis and structure-activity relationships of N,N'-di-o-tolylguanidine analogues, high-affinity ligands for the haloperidol-sensitive sigma receptor. J Med Chem 33:2421-9 (1990)  
Target
Name:
Sigma non-opioid intracellular receptor 1
Synonyms:
Aging-associated gene 8 protein SGMR1_HUMAN SIGMAR1 SR31747-binding protein Sigma 1-type opioid receptor Sigma1R | hSigmaR1
Type:
Enzyme Catalytic Domain
Mol. Mass.:
25124.85
Organism:
Homo sapiens (Human)
Description:
Q99720
Residue:
223
  
Inhibitor
Name:
BDBM50010741
Synonyms:
1-Phenyl-imidazolidin-2-ylideneamine; hydrobromide | CHEMBL543123
Type:
Small organic molecule
Emp. Form.:
C9H11N3
Mol. Mass.:
161.2037
SMILES:
NC1=NCCN1c1ccccc1
: