Target
Renin
Ligand
BDBM50014121
Substrate
Meas. Tech.
ChEBML_195950
IC50
710±n/a nM
Citation
 Dutta, ASGormley, JJMcLachlan, PFMajor, JS Novel inhibitors of human renin. Cyclic peptides based on the tetrapeptide sequence Glu-D-Phe-Lys-D-Trp. J Med Chem 33:2552-60 (1990)  
Target
Name:
Renin
Synonyms:
Angiotensinogenase RENI_HUMAN
Type:
Enzyme
Mol. Mass.:
45058.99
Organism:
Homo sapiens (Human)
Description:
Residue:
406
  
Inhibitor
Name:
BDBM50014121
Synonyms:
6-Amino-2-(6-amino-3-benzyl-2,5,9-trioxo-[1,4]diazonan-1-yl)-hexanoic acid [2-(1H-indol-3-yl)-1-(3-methyl-butylcarbamoyl)-ethyl]-amide | CHEMBL315320
Type:
Small organic molecule
Emp. Form.:
C36H49N7O5
Mol. Mass.:
659.8182
SMILES:
CC(C)CCNC(=O)[C@H](Cc1c[nH]c2ccccc12)NC(=O)[C@H](CCCCN)N1C(=O)CC[C@@H](N)C(=O)N[C@H](Cc2ccccc2)C1=O
: