Target
Dihydrofolate reductase
Ligand
BDBM50367055
Substrate
Meas. Tech.
ChEBML_53962
IC50
25±n/a nM
Citation
 Rosowsky, ABader, HFreisheim, JH Analogues of methotrexate and aminopterin with gamma-methylene and gamma-cyano substitution of the glutamate side chain: synthesis and in vitro biological activity. J Med Chem 34:203-8 (1991)  
Target
Name:
Dihydrofolate reductase
Synonyms:
DHFR Dihydrofolate reductase (DHFR) | Tetrahydrofolate dehydrogenase
Type:
Enzyme
Mol. Mass.:
21453.99
Organism:
Homo sapiens (Human)
Description:
Recombinant human DHFR.
Residue:
187
  
Inhibitor
Name:
BDBM50367055
Synonyms:
4-Aminofolic acid AMINOPTERIN | Aminopteroylglutamic acid
Type:
Small organic molecule
Emp. Form.:
C19H20N8O5
Mol. Mass.:
440.4127
SMILES:
Nc1nc(N)c2nc(CNc3ccc(cc3)C(=O)N[C@@H](CCC(O)=O)C(O)=O)cnc2n1
: