Target
3-hydroxy-3-methylglutaryl-coenzyme A reductase
Ligand
BDBM50007284
Substrate
Meas. Tech.
ChEBML_78556
IC50
15000±n/a nM
Citation
 Jendralla, HGranzer, Evon Kerekjarto, BKrause, RSchacht, UBaader, EBartmann, WBeck, GBergmann, AKesseler, K Synthesis and biological activity of new HMG-CoA reductase inhibitors. 3. Lactones of 6-phenoxy-3,5-dihydroxyhexanoic acids. J Med Chem 34:2962-83 (1991)  
Target
Name:
3-hydroxy-3-methylglutaryl-coenzyme A reductase
Synonyms:
3-hydroxy-3-methylglutaryl-coenzyme A (HMG-CoA) reductase HMDH_HUMAN HMG-CoA reductase (HMGR) | HMGCR
Type:
Enzyme
Mol. Mass.:
97477.10
Organism:
Homo sapiens (Human)
Description:
P04035
Residue:
888
  
Inhibitor
Name:
BDBM50007284
Synonyms:
CHEMBL101600 | Sodium; 6-{2-[cyclohexyl-(2,2-dimethyl-butyrylamino)-methyl]-4,6-dimethyl-phenoxy}-3,5-dihydroxy-hexanoate
Type:
Small organic molecule
Emp. Form.:
C27H42NO6
Mol. Mass.:
476.626
SMILES:
CCC(C)(C)C(=O)NC(C1CCCCC1)c1cc(C)cc(C)c1OCC(O)C[C@@H](O)CC([O-])=O
: