Target
3-hydroxy-3-methylglutaryl-coenzyme A reductase
Ligand
BDBM50007264
Substrate
Meas. Tech.
ChEBML_80660
IC50
400±n/a nM
Citation
 Jendralla, HGranzer, Evon Kerekjarto, BKrause, RSchacht, UBaader, EBartmann, WBeck, GBergmann, AKesseler, K Synthesis and biological activity of new HMG-CoA reductase inhibitors. 3. Lactones of 6-phenoxy-3,5-dihydroxyhexanoic acids. J Med Chem 34:2962-83 (1991)  
Target
Name:
3-hydroxy-3-methylglutaryl-coenzyme A reductase
Synonyms:
HMDH_RAT Hmgcr
Type:
Enzyme
Mol. Mass.:
96689.85
Organism:
Rattus norvegicus (rat)
Description:
Isolated rat liver microsomes were used as enzyme source.
Residue:
887
  
Inhibitor
Name:
BDBM50007264
Synonyms:
CHEMBL99838 | Sodium; 6-(5-cyclohexylmethyl-3-isopropyl-biphenyl-4-yloxy)-3,5-dihydroxy-hexanoate
Type:
Small organic molecule
Emp. Form.:
C28H37O5
Mol. Mass.:
453.5909
SMILES:
CC(C)c1cc(cc(CC2CCCCC2)c1OCC(O)C[C@@H](O)CC([O-])=O)-c1ccccc1
: