Target
3-hydroxy-3-methylglutaryl-coenzyme A reductase
Ligand
BDBM50007305
Substrate
Meas. Tech.
ChEBML_80660
IC50
80±n/a nM
Citation
 Jendralla, HGranzer, Evon Kerekjarto, BKrause, RSchacht, UBaader, EBartmann, WBeck, GBergmann, AKesseler, K Synthesis and biological activity of new HMG-CoA reductase inhibitors. 3. Lactones of 6-phenoxy-3,5-dihydroxyhexanoic acids. J Med Chem 34:2962-83 (1991)  
Target
Name:
3-hydroxy-3-methylglutaryl-coenzyme A reductase
Synonyms:
HMDH_RAT Hmgcr
Type:
Enzyme
Mol. Mass.:
96689.85
Organism:
Rattus norvegicus (rat)
Description:
Isolated rat liver microsomes were used as enzyme source.
Residue:
887
  
Inhibitor
Name:
BDBM50007305
Synonyms:
CHEMBL319983 | Sodium; 6-{4-chloro-2-[3-(4-fluoro-phenoxy)-propyl]-6-methyl-phenoxy}-3,5-dihydroxy-hexanoate
Type:
Small organic molecule
Emp. Form.:
C22H25ClFO6
Mol. Mass.:
439.882
SMILES:
Cc1cc(Cl)cc(CCCOc2ccc(F)cc2)c1OCC(O)C[C@@H](O)CC([O-])=O
: