Target
Muscarinic acetylcholine receptor M1
Ligand
BDBM50010097
Substrate
Meas. Tech.
ChEBML_139068
Ki
5.5±n/a nM
Citation
 Hudkins, RLDeHaven-Hudkins, DLStubbins, JF Muscarinic receptor binding profile of para-substituted caramiphen analogues. J Med Chem 34:2984-9 (1991)  
Target
Name:
Muscarinic acetylcholine receptor M1
Synonyms:
ACM1_RAT Chrm-1 cholinergic receptor, muscarinic 1
Type:
Enzyme Catalytic Domain
Mol. Mass.:
51390.46
Organism:
RAT
Description:
P08482
Residue:
460
  
Inhibitor
Name:
BDBM50010097
Synonyms:
1-(4-Nitro-phenyl)-cyclopentanecarboxylic acid 2-diethylamino-ethyl ester; hydrochloride | CHEMBL543382
Type:
Small organic molecule
Emp. Form.:
C18H26N2O4
Mol. Mass.:
334.41
SMILES:
CCN(CC)CCOC(=O)C1(CCCC1)c1ccc(cc1)[N+]([O-])=O
: