Target
Muscarinic acetylcholine receptor M1
Ligand
BDBM50368151
Substrate
Meas. Tech.
ChEBML_139202
Ki
11±n/a nM
Citation
 Triggle, DJKwon, YWAbraham, PPitner, JBMascarella, SWCarroll, FI Synthesis, molecular modeling studies, and muscarinic receptor activity of azaprophen analogues. J Med Chem 34:3164-71 (1991)  
Target
Name:
Muscarinic acetylcholine receptor M1
Synonyms:
ACM1_RAT Chrm-1 cholinergic receptor, muscarinic 1
Type:
Enzyme Catalytic Domain
Mol. Mass.:
51390.46
Organism:
RAT
Description:
P08482
Residue:
460
  
Inhibitor
Name:
BDBM50368151
Synonyms:
CHEMBL322582
Type:
Small organic molecule
Emp. Form.:
C29H31NO2
Mol. Mass.:
425.5619
SMILES:
CC(C(=O)OC1CC2CC(C1)N(Cc1ccccc1)C2)(c1ccccc1)c1ccccc1
: