Target
D(2) dopamine receptor
Ligand
BDBM50010301
Substrate
Meas. Tech.
ChEMBL_59152 (CHEMBL671033)
Ki
1360±n/a nM
Citation
 Bakthavachalam, VBaindur, NMadras, BKNeumeyer, JL Fluorescent probes for dopamine receptors: synthesis and characterization of fluorescein and 7-nitrobenz-2-oxa-1,3-diazol-4-yl conjugates of D-1 and D-2 receptor ligands. J Med Chem 34:3235-41 (1991)  
Target
Name:
D(2) dopamine receptor
Synonyms:
D(2) dopamine receptor DOPAMINE D2 Long DRD2 Dopamine D2 receptor Dopamine D2 receptor (D2R) Dopamine2-like | d2
Type:
Cell-surface receptors
Mol. Mass.:
50647.10
Organism:
Homo sapiens (Human)
Description:
P14416
Residue:
443
  
Inhibitor
Name:
BDBM50010301
Synonyms:
8-Bromo-3-methyl-5-phenyl-2,3,4,5-tetrahydro-1H-benzo[d]azepin-7-ol(SKF 83566) SKF 83566
Type:
Small organic molecule
Emp. Form.:
C17H18BrNO
Mol. Mass.:
332.235
SMILES:
CN1CCc2cc(Br)c(O)cc2C(C1)c1ccccc1
: