Target
D(1A) dopamine receptor
Ligand
BDBM50010301
Substrate
Meas. Tech.
ChEMBL_60185 (CHEMBL872877)
Ki
0.300000±n/a nM
Citation
 Bakthavachalam, VBaindur, NMadras, BKNeumeyer, JL Fluorescent probes for dopamine receptors: synthesis and characterization of fluorescein and 7-nitrobenz-2-oxa-1,3-diazol-4-yl conjugates of D-1 and D-2 receptor ligands. J Med Chem 34:3235-41 (1991)  
Target
Name:
D(1A) dopamine receptor
Synonyms:
DA D1 receptor DRD1 Dopamine D1 receptor Dopamine D1A
Type:
Enzyme
Mol. Mass.:
49303.43
Organism:
Homo sapiens (Human)
Description:
P21728
Residue:
446
  
Inhibitor
Name:
BDBM50010301
Synonyms:
8-Bromo-3-methyl-5-phenyl-2,3,4,5-tetrahydro-1H-benzo[d]azepin-7-ol(SKF 83566) SKF 83566
Type:
Small organic molecule
Emp. Form.:
C17H18BrNO
Mol. Mass.:
332.235
SMILES:
CN1CCc2cc(Br)c(O)cc2C(C1)c1ccccc1
: