Target
Renin
Ligand
BDBM50010420
Substrate
Meas. Tech.
ChEBML_195762
IC50
8.5±n/a nM
Citation
 Raddatz, PJonczyk, AMinck, KOSchmitges, CJSombroek, J Substrate analogue renin inhibitors containing replacements of histidine in P2 or isosteres of the amide bond between P3 and P2 sites. J Med Chem 34:3267-80 (1991)  
Target
Name:
Renin
Synonyms:
Angiotensinogenase RENI_HUMAN
Type:
Enzyme
Mol. Mass.:
45058.99
Organism:
Homo sapiens (Human)
Description:
Residue:
406
  
Inhibitor
Name:
BDBM50010420
Synonyms:
CHEMBL325119 | [4-(3-{1-[(4-Amino-2-methyl-pyrimidin-5-ylmethyl)-carbamoyl]-2-methyl-butylcarbamoyl}-1-cyclohexylmethyl-2-hydroxy-propylcarbamoyl)-1-benzyl-2-oxo-butyl]-carbamic acid tert-butyl ester
Type:
Small organic molecule
Emp. Form.:
C40H61N7O7
Mol. Mass.:
751.955
SMILES:
CC[C@H](C)[C@H](NC(=O)C[C@H](O)[C@H](CC1CCCCC1)NC(=O)CCC(=O)[C@H](Cc1ccccc1)NC(=O)OC(C)(C)C)C(=O)NCc1cnc(C)nc1N
: