Target
Pepsin A
Ligand
BDBM50010426
Substrate
Meas. Tech.
ChEBML_153980
IC50
53000±n/a nM
Citation
 Raddatz, PJonczyk, AMinck, KOSchmitges, CJSombroek, J Substrate analogue renin inhibitors containing replacements of histidine in P2 or isosteres of the amide bond between P3 and P2 sites. J Med Chem 34:3267-80 (1991)  
Target
Name:
Pepsin A
Synonyms:
PEPA_PIG Pepsin | Pepsin A precursor
Type:
Enzyme
Mol. Mass.:
41232.87
Organism:
Porcine
Description:
Residue:
385
  
Inhibitor
Name:
BDBM50010426
Synonyms:
CHEMBL324588 | {3-[(3-{1-[(4-Amino-2-methyl-pyrimidin-5-ylmethyl)-carbamoyl]-2-methyl-butylcarbamoyl}-1-cyclohexylmethyl-2-hydroxy-propylcarbamoyl)-methylsulfanyl]-1-benzyl-2-oxo-propyl}-carbamic acid tert-butyl ester
Type:
Small organic molecule
Emp. Form.:
C40H61N7O7S
Mol. Mass.:
784.02
SMILES:
CC[C@H](C)[C@H](NC(=O)C[C@H](O)[C@H](CC1CCCCC1)NC(=O)CSCC(=O)[C@H](Cc1ccccc1)NC(=O)OC(C)(C)C)C(=O)NCc1cnc(C)nc1N
: