Target
Renin
Ligand
BDBM50010427
Substrate
Meas. Tech.
ChEBML_195762
IC50
2.5±n/a nM
Citation
 Raddatz, PJonczyk, AMinck, KOSchmitges, CJSombroek, J Substrate analogue renin inhibitors containing replacements of histidine in P2 or isosteres of the amide bond between P3 and P2 sites. J Med Chem 34:3267-80 (1991)  
Target
Name:
Renin
Synonyms:
Angiotensinogenase RENI_HUMAN
Type:
Enzyme
Mol. Mass.:
45058.99
Organism:
Homo sapiens (Human)
Description:
Residue:
406
  
Inhibitor
Name:
BDBM50010427
Synonyms:
BOC-Phe-Gly-ACHPA-Ile N-[(4-amino-2-methyl-5-pyrimidinyl)methyl]amide | CHEMBL109768
Type:
Small organic molecule
Emp. Form.:
C39H60N8O7
Mol. Mass.:
752.9431
SMILES:
CC[C@H](C)[C@H](NC(=O)C[C@H](O)[C@@H](CC1CCCCC1)NC(=O)CNC(=O)[C@@H](Cc1ccccc1)NC(=O)OC(C)(C)C)C(=O)NCc1cnc(C)nc1N
: