Target
Gag-Pol polyprotein [489-587]
Ligand
BDBM50005698
Substrate
Meas. Tech.
ChEMBL_160732 (CHEMBL878991)
IC50
13±n/a nM
Citation
 Krohn, ARedshaw, SRitchie, JCGraves, BJHatada, MH Novel binding mode of highly potent HIV-proteinase inhibitors incorporating the (R)-hydroxyethylamine isostere. J Med Chem 34:3340-2 (1991)  
Target
Name:
Gag-Pol polyprotein [489-587]
Synonyms:
Human immunodeficiency virus type 1 protease Pol polyprotein | gag-pol
Type:
Enzyme Subunit
Mol. Mass.:
10781.16
Organism:
Human immunodeficiency virus type 1
Description:
P04585[489-587]
Residue:
99
  
Inhibitor
Name:
BDBM50005698
Synonyms:
2-[2-({1-[3-(2-Benzyloxycarbonylamino-3-carbamoyl-propionylamino)-2-hydroxy-4-phenyl-butyl]-pyrrolidine-2-carbonyl}-amino)-3-methyl-pentanoylamino]-3-methyl-butyric acid methyl ester CHEMBL321377
Type:
Small organic molecule
Emp. Form.:
C39H56N6O9
Mol. Mass.:
752.8967
SMILES:
CC[C@H](C)[C@H](NC(=O)[C@@H]1CCCN1C[C@H](O)[C@H](Cc1ccccc1)NC(=O)[C@H](CC(N)=O)NC(=O)OCc1ccccc1)C(=O)N[C@@H](C(C)C)C(=O)OC
: